BDBM50119238 4-Methyl-2-[3-(naphthalen-1-yloxy)-propionylamino]-pentanoic acid (2-hydroxy-5-oxo-tetrahydro-furan-3-yl)-amide::CHEMBL102901
SMILES CC(C)C[C@H](NC(=O)CCOc1cccc2ccccc12)C(=O)N[C@H]1CC(=O)OC1O
InChI Key InChIKey=WIYBIQZLIVGWQF-JOHXPNBHSA-N
Data  5 IC50
  Tab Delimited (TSV)   2D SDfile   Computed 3D by Vconf -m prep SDfile
Find this compound or compounds like it in BindingDB:
Activity Spreadsheet -- Enzyme Inhibition Constant Data from BindingDB
Found 1 hit for monomerid = 50119238
TargetCaspase-8(Homo sapiens (Human))
Idun Pharmaceuticals
Curated by ChEMBL
LigandPNGBDBM50119238(4-Methyl-2-[3-(naphthalen-1-yloxy)-propionylamino]...)
Affinity DataIC50:  9.81E+3nM. Assay description: Inhibitory concentration against caspase-8
In DepthDetails ArticlePubMed