BDBM50119821 2-[3-(6-Amino-purin-9-yl)-propoxy]-N-hydroxy-acetamide::CHEMBL105178
SMILES Nc1ncnc2n(CCCOCC(=O)NO)cnc12
InChI Key InChIKey=IEXUMNLSIREDAK-UHFFFAOYSA-N
Data  2 IC50
  Tab Delimited (TSV)   2D SDfile   Computed 3D by Vconf -m prep SDfile
Find this compound or compounds like it in BindingDB:
Activity Spreadsheet -- Enzyme Inhibition Constant Data from BindingDB
Found 1 hit for monomerid = 50119821
TargetAdenylate cyclase type 5(Homo sapiens (Human))
Millennium Pharmaceuticals
Curated by ChEMBL
LigandPNGBDBM50119821(2-[3-(6-Amino-purin-9-yl)-propoxy]-N-hydroxy-aceta...)
Affinity DataIC50:  9.40E+4nM. Assay description: Inhibition of recombinant human adenylate cyclase 5 expressed in HEK293 cells
In DepthDetails ArticlePubMed