BDBM50120544 7-Methyl-2-[4-(3-pyrrolidin-1-yl-propoxy)-phenyl]-imidazo[1,2-a]pyridine::CHEMBL324650
SMILES Cc1ccn2cc(nc2c1)-c1ccc(OCCCN2CCCC2)cc1
InChI Key InChIKey=MVBPOZZUALTPQG-UHFFFAOYSA-N
Data  1 KI
  Tab Delimited (TSV)   2D SDfile   Computed 3D by Vconf -m prep SDfile
Find this compound or compounds like it in BindingDB:
Activity Spreadsheet -- Enzyme Inhibition Constant Data from BindingDB
Found 1 hit for monomerid = 50120544
TargetHistamine H3 receptor(Homo sapiens (Human))
Johnson And Johnson Pharmaceutical Research And Development
Curated by ChEMBL
LigandPNGBDBM50120544(7-Methyl-2-[4-(3-pyrrolidin-1-yl-propoxy)-phenyl]-...)
Affinity DataKi:  5nM. Assay description: Binding affinity for human histamine H3 receptor
In DepthDetails ArticlePubMed