BDBM50120718 2-Pyridin-3-yl-1,3,4,5-tetrahydro-azepino[5,4,3-cd]indol-6-one::CHEMBL343665
SMILES O=C1NCCc2c([nH]c3cccc1c23)-c1cccnc1
InChI Key InChIKey=KXPPOBXQOHQSAK-UHFFFAOYSA-N
Data  1 KI
  Tab Delimited (TSV)   2D SDfile   Computed 3D by Vconf -m prep SDfile
Find this compound or compounds like it in BindingDB:
Activity Spreadsheet -- Enzyme Inhibition Constant Data from BindingDB
Found 1 hit for monomerid = 50120718
TargetPoly [ADP-ribose] polymerase 1(Homo sapiens (Human))
Pfizer
Curated by ChEMBL
LigandPNGBDBM50120718(2-Pyridin-3-yl-1,3,4,5-tetrahydro-azepino[5,4,3-cd...)
Affinity DataKi:  7nM. Assay description: In vitro inhibitory activity towards human poly(ADP-ribose) polymerase 1 (PARP-1).
In DepthDetails ArticlePubMed