BDBM50121254 CHEMBL414541::F-G-G-F-T-G-A-R-K-S-MeA-R-K-L-A-N-Q-COOH
SMILES CC(C)C[C@H](NC(=O)[C@H](CCCCN)NC(=O)[C@H](CCCNC(N)=N)NC(=O)[C@H](C)N(C)C(=O)[C@H](CO)NC(=O)[C@H](CCCCN)NC(=O)[C@H](CCCNC(N)=N)NC(=O)[C@H](C)NC(=O)CNC(=O)[C@@H](NC(=O)[C@H](Cc1ccccc1)NC(=O)CNC(=O)CNC(=O)[C@@H](N)Cc1ccccc1)[C@@H](C)O)C(=O)N[C@@H](C)C(=O)N[C@@H](CC(N)=O)C(=O)N[C@@H](CCC(N)=O)C(O)=O
InChI Key InChIKey=MJZVYHXPHQEPQQ-FKPOJLNCSA-N
Data  1 KI  1 EC50
  Tab Delimited (TSV)   2D SDfile   Computed 3D by Vconf -m prep SDfile
Find this compound or compounds like it in BindingDB:
Activity Spreadsheet -- Enzyme Inhibition Constant Data from BindingDB
Found 2 hits for monomerid = 50121254
TargetNociceptin receptor(Homo sapiens (Human))
Purdue Pharma
Curated by ChEMBL
LigandPNGBDBM50121254(CHEMBL414541 | F-G-G-F-T-G-A-R-K-S-MeA-R-K-L-A-N-Q...)
Affinity DataKi:  20nM. Assay description: Affinity for human Opioid receptor like 1 (ORL-1) expressed in HEK293 cells
In DepthDetails ArticlePubMed
TargetNociceptin receptor(Homo sapiens (Human))
Purdue Pharma
Curated by ChEMBL
LigandPNGBDBM50121254(CHEMBL414541 | F-G-G-F-T-G-A-R-K-S-MeA-R-K-L-A-N-Q...)
Affinity DataEC50:  407nM. Assay description: Affinity for human Opioid receptor like 1 (ORL-1) expressed in HEK293 cells
In DepthDetails ArticlePubMed