BDBM50121542 CHEMBL155560::Thiophene-2-carboxylic acid {1-[(benzyloxymethyl-cyano-methyl)-carbamoyl]-2-cyclohexyl-ethyl}-amide
SMILES O=C(N[C@@H](COCc1ccccc1)C#N)[C@H](CC1CCCCC1)NC(=O)c1cccs1
InChI Key InChIKey=KYEBLWCRKMEWQN-RTWAWAEBSA-N
Data  1 IC50  1 Kd
  Tab Delimited (TSV)   2D SDfile   Computed 3D by Vconf -m prep SDfile
Find this compound or compounds like it in BindingDB:
Activity Spreadsheet -- Enzyme Inhibition Constant Data from BindingDB
Found 2 hits for monomerid = 50121542
TargetCathepsin S(Homo sapiens (Human))
Boehringer Ingelheim Pharmaceuticals
Curated by ChEMBL
LigandPNGBDBM50121542(CHEMBL155560 | Thiophene-2-carboxylic acid {1-[(be...)
Affinity DataKd:  0.100nM. Assay description: Equilibrium dissocation constant determined using fluorescence based competitive binding assay towards Cathepsin S
In DepthDetails ArticlePubMed
TargetCathepsin S(Homo sapiens (Human))
Boehringer Ingelheim Pharmaceuticals
Curated by ChEMBL
LigandPNGBDBM50121542(CHEMBL155560 | Thiophene-2-carboxylic acid {1-[(be...)
Affinity DataIC50:  5nM. Assay description: Inhibitory concentration against human recombinant Cathepsin S expressed in baculovirus
In DepthDetails ArticlePubMed