BDBM50121555 CHEMBL434893::Morpholine-4-carboxylic acid [3-methyl-1-(3-phenyl-propylcarbamoyl)-butyl]-amide
SMILES CC(C)C[C@H](NC(=O)N1CCOCC1)C(=O)NCCCc1ccccc1
InChI Key InChIKey=LOOQRWJXBHMFCJ-SFHVURJKSA-N
Data  1 IC50
  Tab Delimited (TSV)   2D SDfile   Computed 3D by Vconf -m prep SDfile
Find this compound or compounds like it in BindingDB:
Activity Spreadsheet -- Enzyme Inhibition Constant Data from BindingDB
Found 1 hit for monomerid = 50121555
TargetCathepsin S(Homo sapiens (Human))
Boehringer Ingelheim Pharmaceuticals
Curated by ChEMBL
LigandPNGBDBM50121555(CHEMBL434893 | Morpholine-4-carboxylic acid [3-met...)
Affinity DataIC50: >2.80E+4nM. Assay description: Inhibitory concentration against human recombinant Cathepsin S expressed in baculovirus
In DepthDetails ArticlePubMed