BDBM50121560 CHEMBL345502::Morpholine-4-carboxylic acid [(1-cyano-3-phenyl-propylcarbamoyl)-cyclohexyl-methyl]-amide
SMILES O=C(N[C@@H](CCc1ccccc1)C#N)[C@@H](NC(=O)N1CCOCC1)C1CCCCC1
InChI Key InChIKey=BFSJCBZEUNKESV-SFTDATJTSA-N
Data  1 IC50  1 Kd
  Tab Delimited (TSV)   2D SDfile   Computed 3D by Vconf -m prep SDfile
Find this compound or compounds like it in BindingDB:
Activity Spreadsheet -- Enzyme Inhibition Constant Data from BindingDB
Found 2 hits for monomerid = 50121560
TargetCathepsin S(Homo sapiens (Human))
Boehringer Ingelheim Pharmaceuticals
Curated by ChEMBL
LigandPNGBDBM50121560(CHEMBL345502 | Morpholine-4-carboxylic acid [(1-cy...)
Affinity DataIC50:  84nM. Assay description: Inhibitory concentration against human recombinant Cathepsin S expressed in baculovirus
In DepthDetails ArticlePubMed
TargetCathepsin S(Homo sapiens (Human))
Boehringer Ingelheim Pharmaceuticals
Curated by ChEMBL
LigandPNGBDBM50121560(CHEMBL345502 | Morpholine-4-carboxylic acid [(1-cy...)
Affinity DataKd:  5nM. Assay description: Equilibrium dissocation constant determined using fluorescence based competitive binding assay towards Cathepsin S
In DepthDetails ArticlePubMed