BDBM50121576 CHEMBL153018::Furan-2-carboxylic acid {1-[(benzyloxymethyl-cyano-methyl)-carbamoyl]-2-cyclohexyl-ethyl}-amide
SMILES O=C(N[C@@H](COCc1ccccc1)C#N)[C@H](CC1CCCCC1)NC(=O)c1ccco1
InChI Key InChIKey=RTOCGWNASWAJDD-RTWAWAEBSA-N
Data  1 IC50  1 Kd
  Tab Delimited (TSV)   2D SDfile   Computed 3D by Vconf -m prep SDfile
Find this compound or compounds like it in BindingDB:
Activity Spreadsheet -- Enzyme Inhibition Constant Data from BindingDB
Found 2 hits for monomerid = 50121576
TargetCathepsin S(Homo sapiens (Human))
Boehringer Ingelheim Pharmaceuticals
Curated by ChEMBL
LigandPNGBDBM50121576(CHEMBL153018 | Furan-2-carboxylic acid {1-[(benzyl...)
Affinity DataKd:  0.400nM. Assay description: Equilibrium dissocation constant determined using fluorescence based competitive binding assay towards Cathepsin S
In DepthDetails ArticlePubMed
TargetCathepsin S(Homo sapiens (Human))
Boehringer Ingelheim Pharmaceuticals
Curated by ChEMBL
LigandPNGBDBM50121576(CHEMBL153018 | Furan-2-carboxylic acid {1-[(benzyl...)
Affinity DataIC50:  21nM. Assay description: Inhibitory concentration against human recombinant Cathepsin S expressed in baculovirus
In DepthDetails ArticlePubMed