BDBM50121579 CHEMBL155102::Morpholine-4-carboxylic acid (3-methyl-1-prop-2-ynylcarbamoyl-butyl)-amide
SMILES CC(C)C[C@H](NC(=O)N1CCOCC1)C(=O)NCC#C
InChI Key InChIKey=OWZWRSSDELHGHR-LBPRGKRZSA-N
Data  1 IC50
  Tab Delimited (TSV)   2D SDfile   Computed 3D by Vconf -m prep SDfile
Find this compound or compounds like it in BindingDB:
Activity Spreadsheet -- Enzyme Inhibition Constant Data from BindingDB
Found 1 hit for monomerid = 50121579
TargetCathepsin S(Homo sapiens (Human))
Boehringer Ingelheim Pharmaceuticals
Curated by ChEMBL
LigandPNGBDBM50121579(CHEMBL155102 | Morpholine-4-carboxylic acid (3-met...)
Affinity DataIC50:  9.70E+4nM. Assay description: Inhibitory concentration against human recombinant Cathepsin S expressed in baculovirus
In DepthDetails ArticlePubMed