BDBM50122931 CHEMBL3622168
SMILES CC(C)c1noc(n1)N1CCC(CC1)[C@H]1C[C@H]1COCc1ccc(cc1F)-n1cnnn1
InChI Key InChIKey=SYYKJWTWYPYSRR-PKOBYXMFSA-N
Data  2 EC50
  Tab Delimited (TSV)   2D SDfile   Computed 3D by Vconf -m prep SDfile
Find this compound or compounds like it in BindingDB:
Activity Spreadsheet -- Enzyme Inhibition Constant Data from BindingDB
Found 2 hits for monomerid = 50122931
TargetGlucose-dependent insulinotropic receptor(Mus musculus)
Merck Research Laboratories
Curated by ChEMBL
LigandPNGBDBM50122931(CHEMBL3622168)
Affinity DataEC50:  4.80nM. Assay description: Agonist activity at mouse GPR119 by cAMP assay
In DepthDetails ArticlePubMed
TargetGlucose-dependent insulinotropic receptor(Homo sapiens (Human))
Merck Research Laboratories
Curated by ChEMBL
LigandPNGBDBM50122931(CHEMBL3622168)
Affinity DataEC50:  1.70nM. Assay description: Agonist activity at human GPR119 expressed in CHO cells by cAMP assay
In DepthDetails ArticlePubMed