BDBM50122937 5-Phenyl-pentanoic acid (5-hydroxymethyl-2-isopropyl-1-methyl-3-oxo-1,2,3,4,5,6-hexahydro-benzo[e][1,4]diazocin-8-yl)-amide::CHEMBL333801
SMILES CC(C)[C@@H]1N(C)c2ccc(NC(=O)CCCCc3ccccc3)cc2C[C@@H](CO)NC1=O
InChI Key InChIKey=CRPJNMJMYOTWPH-DHLKQENFSA-N
Data  1 KI
  Tab Delimited (TSV)   2D SDfile   Computed 3D by Vconf -m prep SDfile
Find this compound or compounds like it in BindingDB:
Activity Spreadsheet -- Enzyme Inhibition Constant Data from BindingDB
Found 1 hit for monomerid = 50122937
TargetProtein kinase C alpha type(Homo sapiens (Human))
Georgetown University Medical Center
Curated by ChEMBL
LigandPNGBDBM50122937(5-Phenyl-pentanoic acid (5-hydroxymethyl-2-isoprop...)
Affinity DataKi:  34nM. Assay description: Displacement of PDBU from recombinant Protein kinase C alpha with phosphatidylserine
In DepthDetails ArticlePubMed