BDBM50123139 ((3S,4S)-3-((4-(allyl(pyrimidin-2-yl)amino)piperidin-1-yl)methyl)-4-phenylpyrrolidin-1-yl)(cyclohexyl)methanone::CHEMBL135432::{(3S,4S)-3-[4-(Allyl-pyrimidin-2-yl-amino)-piperidin-1-ylmethyl]-4-phenyl-pyrrolidin-1-yl}-cyclohexyl-methanone
SMILES C=CCN(C1CCN(C[C@H]2CN(C[C@@H]2c2ccccc2)C(=O)C2CCCCC2)CC1)c1ncccn1
InChI Key InChIKey=PDHAEKCRTLZPTQ-XTEPFMGCSA-N
Data  3 IC50
  Tab Delimited (TSV)   2D SDfile   Computed 3D by Vconf -m prep SDfile
Find this compound or compounds like it in BindingDB:
Activity Spreadsheet -- Enzyme Inhibition Constant Data from BindingDB
Found 3 hits for monomerid = 50123139
TargetC-C chemokine receptor type 5(Homo sapiens (Human))
Merck Research Laboratories
Curated by ChEMBL
LigandPNGBDBM50123139(((3S,4S)-3-((4-(allyl(pyrimidin-2-yl)amino)piperid...)
Affinity DataIC50:  12nM. Assay description: Inhibition over 48 hr of BAL strain HIV infrction of HeLa Magi cells expressing CCR5
In DepthDetails ArticlePubMed
TargetC-C chemokine receptor type 5(Homo sapiens (Human))
Merck Research Laboratories
Curated by ChEMBL
LigandPNGBDBM50123139(((3S,4S)-3-((4-(allyl(pyrimidin-2-yl)amino)piperid...)
Affinity DataIC50:  12nM. Assay description: Displacement inhibition of 125-I labeled MIP-alpha from CCR5 receptor expressed on CHO cell membranes
In DepthDetails ArticlePubMed
TargetC-C chemokine receptor type 5(Homo sapiens (Human))
Merck Research Laboratories
Curated by ChEMBL
LigandPNGBDBM50123139(((3S,4S)-3-((4-(allyl(pyrimidin-2-yl)amino)piperid...)
Affinity DataIC50:  12nM. Assay description: Displacement of [125I]MIP1alpha from human CCR5 expressed in CHO cells
In DepthDetails ArticlePubMed