BDBM50124465 CHEMBL367453::Pyridin-2-yl-carbamic acid 4-[5-(2-methoxy-phenoxy)-6-(5-methyl-pyridine-2-sulfonylamino)-2-morpholin-4-yl-pyrimidin-4-yloxy]-but-2-ynyl ester
SMILES COc1ccccc1Oc1c(NS(=O)(=O)c2ccc(C)cn2)nc(nc1OCC#CCOC(=O)Nc1ccccn1)N1CCOCC1
InChI Key InChIKey=PIWOCJNYDKRQRS-UHFFFAOYSA-N
Data  2 IC50
  Tab Delimited (TSV)   2D SDfile   Computed 3D by Vconf -m prep SDfile
Find this compound or compounds like it in BindingDB:
Activity Spreadsheet -- Enzyme Inhibition Constant Data from BindingDB
Found 2 hits for monomerid = 50124465
TargetEndothelin-1 receptor(Homo sapiens (Human))
Actelion Pharmaceuticals
Curated by ChEMBL
LigandPNGBDBM50124465(CHEMBL367453 | Pyridin-2-yl-carbamic acid 4-[5-(2-...)
Affinity DataIC50:  1nM. Assay description: In vitro inhibitory concentration required against [125I]-ET-1 binding to membranes of CHO cells expressing human ETA receptor
In DepthDetails ArticlePubMed
TargetEndothelin receptor type B(Homo sapiens (Human))
Actelion Pharmaceuticals
Curated by ChEMBL
LigandPNGBDBM50124465(CHEMBL367453 | Pyridin-2-yl-carbamic acid 4-[5-(2-...)
Affinity DataIC50:  197nM. Assay description: In vitro inhibitory concentration required against [125I]-ET-1 binding to membranes of CHO cells expressing human ETB receptor
In DepthDetails ArticlePubMed