BDBM50125103 4'-Methyl-biphenyl-2-carboxylic acid [4-(1,3,4,5-tetrahydro-azepino[4,3,2-cd]indole-6-carbonyl)-phenyl]-amide::CHEMBL424183
SMILES Cc1ccc(cc1)-c1ccccc1C(=O)Nc1ccc(cc1)C(=O)N1CCCc2c[nH]c3cccc1c23
InChI Key InChIKey=TWJSVVKBRWHUPB-UHFFFAOYSA-N
Data  2 IC50
  Tab Delimited (TSV)   2D SDfile   Computed 3D by Vconf -m prep SDfile
Find this compound or compounds like it in BindingDB:
Activity Spreadsheet -- Enzyme Inhibition Constant Data from BindingDB
Found 2 hits for monomerid = 50125103
TargetVasopressin V2 receptor(Homo sapiens (Human))
Johnson & Johnson Pharmaceutical Research & Development
Curated by ChEMBL
LigandPNGBDBM50125103(4'-Methyl-biphenyl-2-carboxylic acid [4-(1,3,4,5-t...)
Affinity DataIC50:  11nM. Assay description: Displacement of [3H]-AVP from human V2 receptors expressed in HEK-293 cells
In DepthDetails ArticlePubMed
TargetVasopressin V2 receptor(Homo sapiens (Human))
Johnson & Johnson Pharmaceutical Research & Development
Curated by ChEMBL
LigandPNGBDBM50125103(4'-Methyl-biphenyl-2-carboxylic acid [4-(1,3,4,5-t...)
Affinity DataIC50:  70nM. Assay description: Inhibitory activity of the human V2 receptor was assessed by the accumulation of cAMP in transfected HEK-293 cells.
In DepthDetails ArticlePubMed