BDBM50125634 CHEMBL19653::Cyclopropyl-[4-((R)-6-methoxy-indan-1-yl)-piperazin-1-yl]-methanone
SMILES COc1ccc2CC[C@@H](N3CCN(CC3)C(=O)C3CC3)c2c1
InChI Key InChIKey=IEOWUIZMEVKLQP-QGZVFWFLSA-N
Data  2 IC50
  Tab Delimited (TSV)   2D SDfile   Computed 3D by Vconf -m prep SDfile
Find this compound or compounds like it in BindingDB:
Activity Spreadsheet -- Enzyme Inhibition Constant Data from BindingDB
Found 2 hits for monomerid = 50125634
TargetMelatonin receptor type 1A(Homo sapiens (Human))
Bristol-Myers Squibb Pharmaceutical Research Institute
Curated by ChEMBL
LigandPNGBDBM50125634(CHEMBL19653 | Cyclopropyl-[4-((R)-6-methoxy-indan-...)
Affinity DataIC50:  45nM. Assay description: In vitro receptor binding at MT1 (Melatonin) receptor.
In DepthDetails ArticlePubMed
TargetMelatonin receptor type 1B(Homo sapiens (Human))
Bristol-Myers Squibb Pharmaceutical Research Institute
Curated by ChEMBL
LigandPNGBDBM50125634(CHEMBL19653 | Cyclopropyl-[4-((R)-6-methoxy-indan-...)
Affinity DataIC50:  1.60nM. Assay description: In vitro receptor binding at MT2 (Melatonin) receptor.
In DepthDetails ArticlePubMed