BDBM50125649 4-(6-Methoxy-indan-1-yl)-piperazine-1-carboxylic acid ethylamide::CHEMBL281345
SMILES CCNC(=O)N1CCN(CC1)C1CCc2ccc(OC)cc12
InChI Key InChIKey=SIGOPOHNYSSSMV-UHFFFAOYSA-N
Data  2 IC50
  Tab Delimited (TSV)   2D SDfile   Computed 3D by Vconf -m prep SDfile
Find this compound or compounds like it in BindingDB:
Activity Spreadsheet -- Enzyme Inhibition Constant Data from BindingDB
Found 2 hits for monomerid = 50125649
TargetMelatonin receptor type 1B(Homo sapiens (Human))
Bristol-Myers Squibb Pharmaceutical Research Institute
Curated by ChEMBL
LigandPNGBDBM50125649(4-(6-Methoxy-indan-1-yl)-piperazine-1-carboxylic a...)
Affinity DataIC50:  3.10nM. Assay description: In vitro receptor binding at MT2 (Melatonin) receptor.
In DepthDetails ArticlePubMed
TargetMelatonin receptor type 1A(Homo sapiens (Human))
Bristol-Myers Squibb Pharmaceutical Research Institute
Curated by ChEMBL
LigandPNGBDBM50125649(4-(6-Methoxy-indan-1-yl)-piperazine-1-carboxylic a...)
Affinity DataIC50: >1.00E+3nM. Assay description: In vitro receptor binding at MT1 (Melatonin) receptor.
In DepthDetails ArticlePubMed