BDBM50125921 CHEMBL21910::N-(2-(furan-2-yl)-8-methyl-9-(methylthio)-8H-pyrazolo[4,3-e][1,2,4]triazolo[1,5-c]pyrimidin-5-yl)-2-(4-methoxyphenyl)acetamide::N-(2-Furan-2-yl-8-methyl-9-methylsulfanyl-8H-pyrazolo[4,3-e][1,2,4]triazolo[1,5-c]pyrimidin-5-yl)-2-(4-methoxy-phenyl)-acetamide
SMILES COc1ccc(CC(=O)Nc2nc3nn(C)c(SC)c3c3nc(nn23)-c2ccco2)cc1
InChI Key InChIKey=BUPXLNFYXPSBGC-UHFFFAOYSA-N
Data  6 KI
  Tab Delimited (TSV)   2D SDfile   Computed 3D by Vconf -m prep SDfile
Find this compound or compounds like it in BindingDB:
Activity Spreadsheet -- Enzyme Inhibition Constant Data from BindingDB
Found 6 hits for monomerid = 50125921
TargetAdenosine receptor A2a(Homo sapiens (Human))
Universit£
Curated by ChEMBL
LigandPNGBDBM50125921(CHEMBL21910 | N-(2-(furan-2-yl)-8-methyl-9-(methyl...)
Affinity DataKi:  15nM. Assay description: Displacement of [3H]- SCH-58261 binding at human Adenosine A2A receptor expressed in CHO cells
In DepthDetails ArticlePubMed
TargetAdenosine receptor A2a(Homo sapiens (Human))
Universit£
Curated by ChEMBL
LigandPNGBDBM50125921(CHEMBL21910 | N-(2-(furan-2-yl)-8-methyl-9-(methyl...)
Affinity DataKi:  15nM. Assay description: Displacement of [3H]NECA from human adenosine A2A receptor expressed in CHO cellsChecked by Author
In DepthDetails ArticlePubMed
TargetAdenosine receptor A2b(Homo sapiens (Human))
Universit£
Curated by ChEMBL
LigandPNGBDBM50125921(CHEMBL21910 | N-(2-(furan-2-yl)-8-methyl-9-(methyl...)
Affinity DataKi:  45nM. Assay description: Displacement of [3H]- DPCPX from human adenosine A2B receptor expressed in HEK293 cells
In DepthDetails ArticlePubMed
TargetAdenosine receptor A1(Homo sapiens (Human))
Universit£
Curated by ChEMBL
LigandPNGBDBM50125921(CHEMBL21910 | N-(2-(furan-2-yl)-8-methyl-9-(methyl...)
Affinity DataKi:  80nM. Assay description: Displacement of [3H]- DPCPX binding at human Adenosine A1 receptor expressed in CHO cells
In DepthDetails ArticlePubMed
TargetAdenosine receptor A3(Homo sapiens (Human))
Universit£
Curated by ChEMBL
LigandPNGBDBM50125921(CHEMBL21910 | N-(2-(furan-2-yl)-8-methyl-9-(methyl...)
Affinity DataKi: >1.00E+3nM. Assay description: Displacement of [3H]NECA from human adenosine A3 receptor expressed in CHO cellsChecked by Author
In DepthDetails ArticlePubMed
TargetAdenosine receptor A3(Homo sapiens (Human))
Universit£
Curated by ChEMBL
LigandPNGBDBM50125921(CHEMBL21910 | N-(2-(furan-2-yl)-8-methyl-9-(methyl...)
Affinity DataKi: >1.00E+3nM. Assay description: Displacement of [3H]- MRE 308F20 binding from human Adenosine A3 receptor expressed in CHO cells
In DepthDetails ArticlePubMed