BDBM50125939 3-((S)-1-Phenyl-ethyl)-3H-imidazole-4-carboxylic acid 2-(3-methyl-3H-diazirin-3-yl)-ethyl ester::CHEMBL22676
SMILES C[C@@H](c1ccccc1)n1cncc1C(=O)OCCC1(C)N=N1
InChI Key InChIKey=DUOHNSBKYJHAMQ-LBPRGKRZSA-N
Data  1 IC50  1 EC50
  Tab Delimited (TSV)   2D SDfile   Computed 3D by Vconf -m prep SDfile
Find this compound or compounds like it in BindingDB:
Activity Spreadsheet -- Enzyme Inhibition Constant Data from BindingDB
Found 1 hit for monomerid = 50125939
TargetGamma-aminobutyric acid receptor subunit alpha-1/beta-2/gamma-2(Homo sapiens (Human))
Massachusetts General Hospital
Curated by ChEMBL
LigandPNGBDBM50125939(3-((S)-1-Phenyl-ethyl)-3H-imidazole-4-carboxylic a...)
Affinity DataIC50:  6.63E+4nM. Assay description: In vitro inhibition of 5-(125I)A-85380 binding to nicotinic acetylcholine receptor (nAChR) of rat brain
In DepthDetails ArticlePubMed