BDBM50126495 2-(3-Amino-4-cyclopentylmethanesulfonyl-6-methyl-2-oxo-2H-pyridin-1-yl)-N-(6-amino-2-methyl-pyridin-3-ylmethyl)-acetamide::CHEMBL33480
SMILES Cc1cc(c(N)c(=O)n1CC(=O)NCc1ccc(N)nc1C)S(=O)(=O)CC1CCCC1
InChI Key InChIKey=IXWHJTMAJYJQMO-UHFFFAOYSA-N
Data  2 KI
  Tab Delimited (TSV)   2D SDfile   Computed 3D by Vconf -m prep SDfile
Find this compound or compounds like it in BindingDB:
Activity Spreadsheet -- Enzyme Inhibition Constant Data from BindingDB
Found 2 hits for monomerid = 50126495
TargetProthrombin(Homo sapiens (Human))
Merck Research Laboratories
Curated by ChEMBL
LigandPNGBDBM50126495(2-(3-Amino-4-cyclopentylmethanesulfonyl-6-methyl-2...)
Affinity DataKi:  1.20nM. Assay description: Inhibition of human thrombin
In DepthDetails ArticlePubMed
TargetSerine protease 1(Homo sapiens (Human))
Merck Research Laboratories
Curated by ChEMBL
LigandPNGBDBM50126495(2-(3-Amino-4-cyclopentylmethanesulfonyl-6-methyl-2...)
Affinity DataKi:  630nM. Assay description: Inhibitory activity of the compound against human trypsin
In DepthDetails ArticlePubMed