BDBM50127170 4-cyclobutylmethyl-10-hydroxy-17-(3-phenylpropoxy)-(13R,17S)-12-oxa-4-azapentacyclo[9.6.1.01,13.05,17.07,18]octadeca-7,9,11(18)-trien-14-one
SMILES Oc1ccc2CC3N(CC4CCC4)CC[C@@]45[C@@H](Oc1c24)C(=O)CC[C@@]35OCCCc1ccccc1
InChI Key InChIKey=RZYIZTFGVJVPEF-HJKUHESWSA-N
Data  3 KI
  Tab Delimited (TSV)   2D SDfile   Computed 3D by Vconf -m prep SDfile
Find this compound or compounds like it in BindingDB:
Activity Spreadsheet -- Enzyme Inhibition Constant Data from BindingDB
Found 3 hits for monomerid = 50127170
TargetMu-type opioid receptor(Rattus norvegicus (rat))
University Of Innsbruck
Curated by ChEMBL
LigandPNGBDBM50127170(4-cyclobutylmethyl-10-hydroxy-17-(3-phenylpropoxy)...)
Affinity DataKi:  0.25nM. Assay description: In vitro binding affinity at opioid receptor mu 1 was determined in C6 rat glioma cells using [3H]DAMGO
In DepthDetails ArticlePubMed
TargetDelta-type opioid receptor(Rattus norvegicus (rat))
University Of Innsbruck
Curated by ChEMBL
LigandPNGBDBM50127170(4-cyclobutylmethyl-10-hydroxy-17-(3-phenylpropoxy)...)
Affinity DataKi:  0.460nM. Assay description: In vitro binding affinity at opioid receptor delta 1 was determined in C6 rat glioma cells using [3H]Ile5,6 deltorphin II
In DepthDetails ArticlePubMed
TargetKappa-type opioid receptor(Homo sapiens (Human))
University Of Innsbruck
Curated by ChEMBL
LigandPNGBDBM50127170(4-cyclobutylmethyl-10-hydroxy-17-(3-phenylpropoxy)...)
Affinity DataKi:  0.490nM. Assay description: In vitro binding affinity at opioid receptor kappa 1 was determined in human CHO cells using [3H]U-69593
In DepthDetails ArticlePubMed