BDBM50128014 1-(2,6-Difluoro-benzyl)-5-(3-methoxy-phenyl)-6-methyl-3-[2-(2-pyridin-2-ylmethyl-pyrrolidin-1-yl)-ethyl]-1H-pyrimidine-2,4-dione::CHEMBL303140
SMILES COc1cccc(c1)-c1c(C)n(Cc2c(F)cccc2F)c(=O)n(CCN2CCC[C@H]2Cc2ccccn2)c1=O
InChI Key InChIKey=ZDCWXVJQXPCCNL-DEOSSOPVSA-N
Data  1 KI
  Tab Delimited (TSV)   2D SDfile   Computed 3D by Vconf -m prep SDfile
Find this compound or compounds like it in BindingDB:
Activity Spreadsheet -- Enzyme Inhibition Constant Data from BindingDB
Found 1 hit for monomerid = 50128014
TargetGonadotropin-releasing hormone receptor(Homo sapiens (Human))
Neurocrine Biosciences
Curated by ChEMBL
LigandPNGBDBM50128014(1-(2,6-Difluoro-benzyl)-5-(3-methoxy-phenyl)-6-met...)
Affinity DataKi:  130nM. Assay description: Binding affinity was determined towards human gonadotropin-releasing hormone receptor
In DepthDetails ArticlePubMed