BDBM50128213 CHEMBL71371::Sulfamic acid 10,13-dimethyl-17-oxo-2,3,4,7,8,9,10,11,12,13,14,15,16,17-tetradecahydro-1H-cyclopenta[a]phenanthren-3-yl ester
SMILES C[C@]12CCC3C(CC=C4CC(CC[C@]34C)OS(N)(=O)=O)C1CCC2=O
InChI Key InChIKey=PGZGPYMGHNIKHG-WYTRLKPUSA-N
Data  3 KI
  Tab Delimited (TSV)   2D SDfile   Computed 3D by Vconf -m prep SDfile
Find this compound or compounds like it in BindingDB:
Activity Spreadsheet -- Enzyme Inhibition Constant Data from BindingDB
Found 3 hits for monomerid = 50128213
TargetCarbonic anhydrase 2(Homo sapiens (Human))
University Of Montpellier
Curated by ChEMBL
LigandPNGBDBM50128213(CHEMBL71371 | Sulfamic acid 10,13-dimethyl-17-oxo-...)
Affinity DataKi:  27nM. Assay description: Inhibition of human carbonic anhydrase II
In DepthDetails ArticlePubMed
TargetCarbonic anhydrase 1(Homo sapiens (Human))
University Of Montpellier
Curated by ChEMBL
LigandPNGBDBM50128213(CHEMBL71371 | Sulfamic acid 10,13-dimethyl-17-oxo-...)
Affinity DataKi:  31nM. Assay description: Inhibition of human recombinant carbonic anhydrase I
In DepthDetails ArticlePubMed
TargetCarbonic anhydrase 9(Homo sapiens (Human))
University Of Montpellier
Curated by ChEMBL
LigandPNGBDBM50128213(CHEMBL71371 | Sulfamic acid 10,13-dimethyl-17-oxo-...)
Affinity DataKi:  44nM. Assay description: Inhibitory concentration against catalytic domain of human cloned carbonic anhydrase IX.
In DepthDetails ArticlePubMed