BDBM50128218 CHEMBL302593::Sulfamic acid 5-(2,2-dimethyl-[1,3]dioxolan-4-yl)-2,2-dimethyl-tetrahydro-furo[2,3-d][1,3]dioxol-6-yl ester
SMILES CC1(C)OCC(O1)C1OC2OC(C)(C)OC2[C@H]1OS(N)(=O)=O
InChI Key InChIKey=NEFHIYCLJNJIDP-DVOJEQBISA-N
Data  3 KI
  Tab Delimited (TSV)   2D SDfile   Computed 3D by Vconf -m prep SDfile
Find this compound or compounds like it in BindingDB:
Activity Spreadsheet -- Enzyme Inhibition Constant Data from BindingDB
Found 3 hits for monomerid = 50128218
TargetCarbonic anhydrase 2(Homo sapiens (Human))
University Of Montpellier
Curated by ChEMBL
LigandPNGBDBM50128218(CHEMBL302593 | Sulfamic acid 5-(2,2-dimethyl-[1,3]...)
Affinity DataKi:  15nM. Assay description: Inhibition of human carbonic anhydrase II
In DepthDetails ArticlePubMed
TargetCarbonic anhydrase 9(Homo sapiens (Human))
University Of Montpellier
Curated by ChEMBL
LigandPNGBDBM50128218(CHEMBL302593 | Sulfamic acid 5-(2,2-dimethyl-[1,3]...)
Affinity DataKi:  39nM. Assay description: Inhibitory concentration against catalytic domain of human cloned carbonic anhydrase IX.
In DepthDetails ArticlePubMed
TargetCarbonic anhydrase 1(Homo sapiens (Human))
University Of Montpellier
Curated by ChEMBL
LigandPNGBDBM50128218(CHEMBL302593 | Sulfamic acid 5-(2,2-dimethyl-[1,3]...)
Affinity DataKi:  278nM. Assay description: Inhibition of human recombinant carbonic anhydrase I
In DepthDetails ArticlePubMed