BDBM50128225 CHEMBL303942::Sulfamic acid 2,4,6-trichloro-phenyl ester
SMILES NS(=O)(=O)Oc1c(Cl)cc(Cl)cc1Cl
InChI Key InChIKey=YZGYKEJWCZUPMT-UHFFFAOYSA-N
Data  3 KI
  Tab Delimited (TSV)   2D SDfile   Computed 3D by Vconf -m prep SDfile
Find this compound or compounds like it in BindingDB:
Activity Spreadsheet -- Enzyme Inhibition Constant Data from BindingDB
Found 3 hits for monomerid = 50128225
TargetCarbonic anhydrase 9(Homo sapiens (Human))
University Of Montpellier
Curated by ChEMBL
LigandPNGBDBM50128225(CHEMBL303942 | Sulfamic acid 2,4,6-trichloro-pheny...)
Affinity DataKi:  37nM. Assay description: Inhibitory concentration against catalytic domain of human cloned carbonic anhydrase IX.
In DepthDetails ArticlePubMed
TargetCarbonic anhydrase 2(Homo sapiens (Human))
University Of Montpellier
Curated by ChEMBL
LigandPNGBDBM50128225(CHEMBL303942 | Sulfamic acid 2,4,6-trichloro-pheny...)
Affinity DataKi:  138nM. Assay description: Inhibition of human carbonic anhydrase II
In DepthDetails ArticlePubMed
TargetCarbonic anhydrase 1(Homo sapiens (Human))
University Of Montpellier
Curated by ChEMBL
LigandPNGBDBM50128225(CHEMBL303942 | Sulfamic acid 2,4,6-trichloro-pheny...)
Affinity DataKi:  454nM. Assay description: Inhibition of human recombinant carbonic anhydrase I
In DepthDetails ArticlePubMed