BDBM50129209 2-[Benzo[1,3]dioxol-5-ylmethyl-((R)-4-methoxy-benzenesulfonyl)-amino]-3-[3-(4-ethoxy-phenyl)-ureido]-N-hydroxy-propionamide::CHEMBL66321
SMILES CCOc1ccc(NC(=O)NC[C@@H](N(Cc2ccc3OCOc3c2)S(=O)(=O)c2ccc(OC)cc2)C(=O)NO)cc1
InChI Key InChIKey=UVQSMXDFHINCNW-HSZRJFAPSA-N
Data  1 KI
  Tab Delimited (TSV)   2D SDfile   Computed 3D by Vconf -m prep SDfile
Find this compound or compounds like it in BindingDB:
Activity Spreadsheet -- Enzyme Inhibition Constant Data from BindingDB
Found 1 hit for monomerid = 50129209
TargetBone morphogenetic protein 1(Homo sapiens (Human))
Combichem
Curated by ChEMBL
LigandPNGBDBM50129209(2-[Benzo[1,3]dioxol-5-ylmethyl-((R)-4-methoxy-benz...)
Affinity DataKi:  22nM. Assay description: In vitro inhibitory activity against procollagen C-terminal proteinase (PCP) in HT-1080 cells using synthetic peptide as substrate
In DepthDetails ArticlePubMed