BDBM50129472 CHEMBL70949::N-[4-(5,11-Dihydro-dibenzo[b,e][1,4]diazepine-10-carbonyl)-phenyl]-2-methyl-benzamide
SMILES Cc1ccccc1C(=O)Nc1ccc(cc1)C(=O)N1Cc2ccccc2Nc2ccccc12
InChI Key InChIKey=WAEMSRXKPZPDLP-UHFFFAOYSA-N
Data  2 IC50
  Tab Delimited (TSV)   2D SDfile   Computed 3D by Vconf -m prep SDfile
Find this compound or compounds like it in BindingDB:
Activity Spreadsheet -- Enzyme Inhibition Constant Data from BindingDB
Found 2 hits for monomerid = 50129472
TargetVasopressin V2 receptor(Rattus norvegicus (Rat))
Wyeth Research
Curated by ChEMBL
LigandPNGBDBM50129472(CHEMBL70949 | N-[4-(5,11-Dihydro-dibenzo[b,e][1,4]...)
Affinity DataIC50:  42nM. Assay description: Inhibition of [3H]-AVP binding to Dawley rat kidney medullary vasopressin V2 receptor.
In DepthDetails ArticlePubMed
TargetVasopressin V1a receptor(RAT)
Wyeth Research
Curated by ChEMBL
LigandPNGBDBM50129472(CHEMBL70949 | N-[4-(5,11-Dihydro-dibenzo[b,e][1,4]...)
Affinity DataIC50:  19nM. Assay description: Inhibition of [3H]-AVP binding to Dawley rat hepatic vasopressin V1a receptor.
In DepthDetails ArticlePubMed