BDBM50129790 CHEMBL329640::Dimethyl-[4-(6-methyl-benzothiazol-2-yl)-phenyl]-amine
SMILES CN(C)c1ccc(cc1)-c1nc2ccc(C)cc2s1
InChI Key InChIKey=OEOPVJYUCSQVMJ-UHFFFAOYSA-N
Data  2 KI
  Tab Delimited (TSV)   2D SDfile   Computed 3D by Vconf -m prep SDfile
Find this compound or compounds like it in BindingDB:
Activity Spreadsheet -- Enzyme Inhibition Constant Data from BindingDB
Found 2 hits for monomerid = 50129790
TargetAmyloid-beta precursor protein(Homo sapiens (Human))
University Of Pittsburgh
Curated by ChEMBL
LigandPNGBDBM50129790(CHEMBL329640 | Dimethyl-[4-(6-methyl-benzothiazol-...)
Affinity DataKi:  64nM. Assay description: Binding affinity for Amyloid beta 1-40 aggregates in competition with [N-methyl-3H] BTA-1.
In DepthDetails ArticlePubMed
TargetAmyloid-beta precursor protein(Homo sapiens (Human))
University Of Pittsburgh
Curated by ChEMBL
LigandPNGBDBM50129790(CHEMBL329640 | Dimethyl-[4-(6-methyl-benzothiazol-...)
Affinity DataKi:  143nM. Assay description: Binding affinity to amyloid beta (1 to 40) (unknown origin) fibrils
In DepthDetails PubMed