BDBM50129968 4-[7-(1,1-Dimethyl-2-oxo-2-piperidin-1-yl-ethyl)-4-methyl-3-oxo-3,4-dihydro-quinoxalin-2-ylmethyl]-benzamidine::CHEMBL72308
SMILES Cn1c2ccc(cc2nc(Cc2ccc(cc2)C(N)=N)c1=O)C(C)(C)C(=O)N1CCCCC1
InChI Key InChIKey=ZZLHKGIGMFVTHQ-UHFFFAOYSA-N
Data  3 IC50
  Tab Delimited (TSV)   2D SDfile   Computed 3D by Vconf -m prep SDfile
Find this compound or compounds like it in BindingDB:
Activity Spreadsheet -- Enzyme Inhibition Constant Data from BindingDB
Found 3 hits for monomerid = 50129968
TargetPlasminogen(Homo sapiens (Human))
Boehringer Ingelheim Pharma
Curated by ChEMBL
LigandPNGBDBM50129968(4-[7-(1,1-Dimethyl-2-oxo-2-piperidin-1-yl-ethyl)-4...)
Affinity DataIC50:  6.00E+4nM. Assay description: Inhibition of plasmin
In DepthDetails ArticlePubMed
TargetProthrombin(Homo sapiens (Human))
Boehringer Ingelheim Pharma
Curated by ChEMBL
LigandPNGBDBM50129968(4-[7-(1,1-Dimethyl-2-oxo-2-piperidin-1-yl-ethyl)-4...)
Affinity DataIC50:  8nM. Assay description: Inhibition of human thrombin
In DepthDetails ArticlePubMed
TargetCoagulation factor X(Homo sapiens (Human))
Boehringer Ingelheim Pharma
Curated by ChEMBL
LigandPNGBDBM50129968(4-[7-(1,1-Dimethyl-2-oxo-2-piperidin-1-yl-ethyl)-4...)
Affinity DataIC50:  400nM. Assay description: Inhibition of coagulation factor X
In DepthDetails ArticlePubMed