BDBM50130035 CHEMBL3629280
SMILES Cc1c[nH]c2ncnc(-c3ccc(NC(=O)N(CCO)c4ccccc4)c(F)c3)c12
InChI Key InChIKey=FMJHCIVLBIHDBE-UHFFFAOYSA-N
Data  2 IC50
  Tab Delimited (TSV)   2D SDfile   Computed 3D by Vconf -m prep SDfile
Find this compound or compounds like it in BindingDB:
Activity Spreadsheet -- Enzyme Inhibition Constant Data from BindingDB
Found 2 hits for monomerid = 50130035
TargetLIM domain kinase 1(Homo sapiens (Human))
Shanghai Institute Of Technology
Curated by ChEMBL
LigandPNGBDBM50130035(CHEMBL3629280)
Affinity DataIC50:  85nM. Assay description: Inhibition of LIMK1 (unknown origin) using 1 uM cofilin as substrate
In DepthDetails ArticlePubMed
TargetRho-associated protein kinase 2(Homo sapiens (Human))
Shanghai Institute Of Technology
Curated by ChEMBL
LigandPNGBDBM50130035(CHEMBL3629280)
Affinity DataIC50:  4.51E+3nM. Assay description: Inhibition of ROCK2 (unknown origin) after 4 hrs using 1 uM STK2 as substrate
In DepthDetails ArticlePubMed