BDBM50131268 4-[1-(4-Dibutylamino-phenyl)-meth-(Z)-ylidene]-3-phenyl-4H-isoxazol-5-one::CHEMBL89136
SMILES CCCCN(CCCC)c1ccc(\C=C2/C(=O)ON=C2c2ccccc2)cc1
InChI Key InChIKey=BZGPSGPFMNBCJZ-PYCFMQQDSA-N
Data  1 Kd
  Tab Delimited (TSV)   2D SDfile   Computed 3D by Vconf -m prep SDfile
Find this compound or compounds like it in BindingDB:
Activity Spreadsheet -- Enzyme Inhibition Constant Data from BindingDB
Found 1 hit for monomerid = 50131268
TargetAndrogen receptor(Homo sapiens (Human))
The University Of Tokyo
Curated by ChEMBL
LigandPNGBDBM50131268(4-[1-(4-Dibutylamino-phenyl)-meth-(Z)-ylidene]-3-p...)
Affinity DataKd:  1.40nM. Assay description: Dissociation constant against GST-hARLBD was measured in SC-3 cell by using [3H]-testosterone as radioligand
In DepthDetails ArticlePubMed