BDBM50131542 CHEMBL102242
SMILES C[C@@H]([C@H](O)c1ccccc1)N1CCC(Cc2ccccc2)CC1
InChI Key InChIKey=XSFBBGJZQQTFHV-UWJYYQICSA-N
Data  1 IC50
  Tab Delimited (TSV)   2D SDfile   Computed 3D by Vconf -m prep SDfile
Find this compound or compounds like it in BindingDB:
Activity Spreadsheet -- Enzyme Inhibition Constant Data from BindingDB
Found 1 hit for monomerid = 50131542
TargetAlpha-1A/Alpha-1B/Alpha-1D adrenergic receptor(Rattus norvegicus (rat))
Pfizer
Curated by ChEMBL
LigandPNGBDBM50131542(CHEMBL102242)
Affinity DataIC50:  573nM. Assay description: Binding affinity against alpha-1 adrenergic receptor
In DepthDetails ArticlePubMed