BDBM50131676 CHEMBL262807
SMILES C[C@@H]([C@@H](O)c1ccc(O)cc1)N1CCN(Cc2ccccc2)CC1
InChI Key InChIKey=SIPVTPUQMGMVGR-OXJNMPFZSA-N
Data  2 IC50
  Tab Delimited (TSV)   2D SDfile   Computed 3D by Vconf -m prep SDfile
Find this compound or compounds like it in BindingDB:
Activity Spreadsheet -- Enzyme Inhibition Constant Data from BindingDB
Found 1 hit for monomerid = 50131676
TargetAlpha-1A/Alpha-1B/Alpha-1D adrenergic receptor(Rattus norvegicus (rat))
Pfizer
Curated by ChEMBL
LigandPNGBDBM50131676(CHEMBL262807)
Affinity DataIC50:  4.63E+3nM. Assay description: In vitro binding affinity against Alpha-1 adrenergic receptor using [3H]prazosin as radioligand
In DepthDetails ArticlePubMed