BDBM50132593 (S)-6-Amino-2-{(R)-2-[(S)-2-amino-3-(3H-imidazol-4-yl)-propionylamino]-3-mercapto-propionylamino}-hexanoic acid {(S)-1-[(S)-1-[(S)-1-carbamoyl-2-(1H-indol-3-yl)-ethylcarbamoyl]-2-(1H-indol-3-yl)-ethylcarbamoyl]-2-phenyl-ethyl}-amide::CHEMBL320509
SMILES NCCCC[C@H](NC(=O)[C@H](CS)NC(=O)[C@@H](N)Cc1cnc[nH]1)C(=O)N[C@@H](Cc1ccccc1)C(=O)N[C@@H](Cc1c[nH]c2ccccc12)C(=O)N[C@@H](Cc1c[nH]c2ccccc12)C(N)=O
InChI Key InChIKey=CEMAKGYCEDBVQU-CCMAZBEPSA-N
Data  2 IC50
  Tab Delimited (TSV)   2D SDfile   Computed 3D by Vconf -m prep SDfile
Find this compound or compounds like it in BindingDB:
Activity Spreadsheet -- Enzyme Inhibition Constant Data from BindingDB
Found 2 hits for monomerid = 50132593
TargetIntegrase(Human immunodeficiency virus 1)
Nih
Curated by ChEMBL
LigandPNGBDBM50132593((S)-6-Amino-2-{(R)-2-[(S)-2-amino-3-(3H-imidazol-4...)
Affinity DataIC50:  9.00E+4nM. Assay description: In vitro inhibitory activity of the compound against HIV-1 integrase enzyme 3'-end processing
In DepthDetails ArticlePubMed
TargetIntegrase(Human immunodeficiency virus 1)
Nih
Curated by ChEMBL
LigandPNGBDBM50132593((S)-6-Amino-2-{(R)-2-[(S)-2-amino-3-(3H-imidazol-4...)
Affinity DataIC50:  1.02E+5nM. Assay description: In vitro inhibitory activity of the compound against HIV-1 integrase enzyme 3'-end processing
In DepthDetails ArticlePubMed