BDBM50132709 4-Amino-N-[4-methyl-3-(4-pyridin-3-yl-pyrimidin-2-ylamino)-phenyl]-benzamide::4-amino-N-(4-methyl-3-(4-(pyridin-3-yl)pyrimidin-2-ylamino)phenyl)benzamide::CHEMBL326753
SMILES Cc1ccc(NC(=O)c2ccc(N)cc2)cc1Nc1nccc(n1)-c1cccnc1
InChI Key InChIKey=QSOMBOJKYIKONR-UHFFFAOYSA-N
Data  3 IC50
  Tab Delimited (TSV)   2D SDfile   Computed 3D by Vconf -m prep SDfile
Find this compound or compounds like it in BindingDB:
Activity Spreadsheet -- Enzyme Inhibition Constant Data from BindingDB
Found 1 hit for monomerid = 50132709
TargetTyrosine-protein kinase ABL1(Homo sapiens (Human))
Mcgill University/Royal Victoria Hospital
Curated by ChEMBL
LigandPNGBDBM50132709(4-Amino-N-[4-methyl-3-(4-pyridin-3-yl-pyrimidin-2-...)
Affinity DataIC50: >1.00E+4nM. Assay description: Inhibition of c-Abl
In DepthDetails ArticlePubMed