BDBM50133011 (5,7-Dichloro-1H-indol-2-yl)-(4-methyl-piperazin-1-yl)-methanone::(5,7-dichloro-1H-indol-2-yl)(4-methylpiperazin-1-yl)methanone::CHEMBL338937
SMILES CN1CCN(CC1)C(=O)c1cc2cc(Cl)cc(Cl)c2[nH]1
InChI Key InChIKey=KPSNDDMXZUDTOT-UHFFFAOYSA-N
Data  4 KI
  Tab Delimited (TSV)   2D SDfile   Computed 3D by Vconf -m prep SDfile
Find this compound or compounds like it in BindingDB:
Activity Spreadsheet -- Enzyme Inhibition Constant Data from BindingDB
Found 4 hits for monomerid = 50133011
TargetHistamine H4 receptor(Homo sapiens (Human))
Johnson & Johnson Pharmaceutical Research And Development
Curated by ChEMBL
LigandPNGBDBM50133011((5,7-Dichloro-1H-indol-2-yl)-(4-methyl-piperazin-1...)
Affinity DataKi:  11nM. Assay description: Displacement of [3H]histamine from recombinant human histamine H4 receptor in SK-N-MC cells
In DepthDetails ArticlePubMed
TargetHistamine H4 receptor(Homo sapiens (Human))
Johnson & Johnson Pharmaceutical Research And Development
Curated by ChEMBL
LigandPNGBDBM50133011((5,7-Dichloro-1H-indol-2-yl)-(4-methyl-piperazin-1...)
Affinity DataKi:  11nM. Assay description: Displacement of [3H]- histamine from the recombinant human histamine H4 receptor
In DepthDetails ArticlePubMed
TargetHistamine H4 receptor(Homo sapiens (Human))
Johnson & Johnson Pharmaceutical Research And Development
Curated by ChEMBL
LigandPNGBDBM50133011((5,7-Dichloro-1H-indol-2-yl)-(4-methyl-piperazin-1...)
Affinity DataKi:  5.00E+6nM. Assay description: Antagonist activity at Homo sapiens (human) histamine H4 receptor
In DepthDetails Article
TargetHistamine H4 receptor(Homo sapiens (Human))
Johnson & Johnson Pharmaceutical Research And Development
Curated by ChEMBL
LigandPNGBDBM50133011((5,7-Dichloro-1H-indol-2-yl)-(4-methyl-piperazin-1...)
Affinity DataKi:  5.00E+6nM. Assay description: Antagonist activity at Homo sapiens (human) histamine H4 receptor
In DepthDetails Article