BDBM50133341 CHEMBL1966084
SMILES O=C1C=C(NCCc2ccccc2)c2ccccc2C1=O
InChI Key InChIKey=CWFAFDYCTDBGBE-UHFFFAOYSA-N
Data  1 IC50
  Tab Delimited (TSV)   2D SDfile   Computed 3D by Vconf -m prep SDfile
Find this compound or compounds like it in BindingDB:
Activity Spreadsheet -- Enzyme Inhibition Constant Data from BindingDB
Found 1 hit for monomerid = 50133341
TargetMucosa-associated lymphoid tissue lymphoma translocation protein 1(Homo sapiens (Human))
Institute Of Basic Science (Ibs)
Curated by ChEMBL
LigandPNGBDBM50133341(CHEMBL1966084)
Affinity DataIC50: >1.00E+5nM. Assay description: Inhibition of MALT1 in human Jurkat cell lysate preincubated for 2 hrs followed by addition of 25 uM Ac-LRSR-AMC substrate for 3 hrs by fluorescence ...
In DepthDetails ArticlePubMed