BDBM50133348 CHEMBL3634994
SMILES CC(C)NC1=CC(=O)C(=O)c2ccccc12
InChI Key InChIKey=ISSFZUYNUYYULG-UHFFFAOYSA-N
Data  1 IC50
  Tab Delimited (TSV)   2D SDfile   Computed 3D by Vconf -m prep SDfile
Find this compound or compounds like it in BindingDB:
Activity Spreadsheet -- Enzyme Inhibition Constant Data from BindingDB
Found 1 hit for monomerid = 50133348
TargetMucosa-associated lymphoid tissue lymphoma translocation protein 1(Homo sapiens (Human))
Institute Of Basic Science (Ibs)
Curated by ChEMBL
LigandPNGBDBM50133348(CHEMBL3634994)
Affinity DataIC50:  2.04E+4nM. Assay description: Inhibition of MALT1 in human Jurkat cell lysate preincubated for 2 hrs followed by addition of 25 uM Ac-LRSR-AMC substrate for 3 hrs by fluorescence ...
In DepthDetails ArticlePubMed