BDBM50133440 1-(4-Chloro-benzyl)-4-(2-chloro-phenyl)-6-methyl-1,4-dihydro-pyridine-2,3,5-tricarboxylic acid 5-isopropyl ester::CHEMBL115651
SMILES CC(C)OC(=O)C1=C(C)N(Cc2ccc(Cl)cc2)C(C(O)=O)=C(C1c1ccccc1Cl)C(O)=O
InChI Key InChIKey=HLZIBEFSFJTJJG-UHFFFAOYSA-N
Data  2 IC50
  Tab Delimited (TSV)   2D SDfile   Computed 3D by Vconf -m prep SDfile
Find this compound or compounds like it in BindingDB:
Activity Spreadsheet -- Enzyme Inhibition Constant Data from BindingDB
Found 2 hits for monomerid = 50133440
TargetGlycogen phosphorylase, muscle form(Homo sapiens (Human))
Merck Research Laboratories
Curated by ChEMBL
LigandPNGBDBM50133440(1-(4-Chloro-benzyl)-4-(2-chloro-phenyl)-6-methyl-1...)
Affinity DataIC50:  6nM. Assay description: In vitro inhibitory activity against human muscle glycogen phosphorylase a (HMGPa)
In DepthDetails ArticlePubMed
TargetGlycogen phosphorylase, liver form(Homo sapiens (Human))
Merck Research Laboratories
Curated by ChEMBL
LigandPNGBDBM50133440(1-(4-Chloro-benzyl)-4-(2-chloro-phenyl)-6-methyl-1...)
Affinity DataIC50:  2nM. Assay description: In vitro inhibitory activity against human liver glycogen phosphorylase a (HLGPa)
In DepthDetails ArticlePubMed