BDBM50133773 3-[5-(3-Chloro-phenyl)-4-methyl-1H-imidazol-2-yl]-pyridine::CHEMBL119507
SMILES Cc1[nH]c(nc1-c1cccc(Cl)c1)-c1cccnc1
InChI Key InChIKey=MVPMAXOBWUAJBQ-UHFFFAOYSA-N
Data  1 KI
  Tab Delimited (TSV)   2D SDfile   Computed 3D by Vconf -m prep SDfile
Find this compound or compounds like it in BindingDB:
Activity Spreadsheet -- Enzyme Inhibition Constant Data from BindingDB
Found 1 hit for monomerid = 50133773
TargetNeuropeptide Y receptor type 5(Homo sapiens (Human))
Pfizer
Curated by ChEMBL
LigandPNGBDBM50133773(3-[5-(3-Chloro-phenyl)-4-methyl-1H-imidazol-2-yl]-...)
Affinity DataKi:  19nM. Assay description: Binding affinity towards human neuropeptide Y receptor type 5 using [125I]-PYY as radiogigand in baculovirus-infected Sf9 cells
In DepthDetails ArticlePubMed