BDBM50133842 (R)-2-Amino-4-methyl-pentanoic acid {4-[5-[(benzyl-methyl-amino)-methyl]-1-(2,6-difluoro-benzyl)-2,4-dioxo-3-phenyl-1,2,3,4-tetrahydro-thieno[2,3-d]pyrimidin-6-yl]-phenyl}-amide::CHEMBL120149
SMILES CC(C)C[C@H](N)C(=O)Nc1ccc(cc1)-c1sc2n(Cc3c(F)cccc3F)c(=O)n(-c3ccccc3)c(=O)c2c1CN(C)Cc1ccccc1
InChI Key InChIKey=WLIMHZYQJNAZBO-UMSFTDKQSA-N
Data  1 KI
  Tab Delimited (TSV)   2D SDfile   Computed 3D by Vconf -m prep SDfile
Find this compound or compounds like it in BindingDB:
Activity Spreadsheet -- Enzyme Inhibition Constant Data from BindingDB
Found 1 hit for monomerid = 50133842
TargetGonadotropin-releasing hormone receptor(Homo sapiens (Human))
Neurocrine Biosciences
Curated by ChEMBL
LigandPNGBDBM50133842((R)-2-Amino-4-methyl-pentanoic acid {4-[5-[(benzyl...)
Affinity DataKi:  58nM. Assay description: Binding affinity towards human gonadotropin-releasing hormone receptor
In DepthDetails ArticlePubMed