BDBM50133857 5-{[(2-Diethylamino-ethyl)-methyl-amino]-methyl}-1-(2,6-difluoro-benzyl)-6-(4-nitro-phenyl)-3-phenyl-1H-thieno[2,3-d]pyrimidine-2,4-dione::CHEMBL333213
SMILES CCN(CC)CCN(C)Cc1c(sc2n(Cc3c(F)cccc3F)c(=O)n(-c3ccccc3)c(=O)c12)-c1ccc(cc1)[N+]([O-])=O
InChI Key InChIKey=DALGJTKYDUTGMX-UHFFFAOYSA-N
Data  1 KI
  Tab Delimited (TSV)   2D SDfile   Computed 3D by Vconf -m prep SDfile
Find this compound or compounds like it in BindingDB:
Activity Spreadsheet -- Enzyme Inhibition Constant Data from BindingDB
Found 1 hit for monomerid = 50133857
TargetGonadotropin-releasing hormone receptor(Homo sapiens (Human))
Neurocrine Biosciences
Curated by ChEMBL
LigandPNGBDBM50133857(5-{[(2-Diethylamino-ethyl)-methyl-amino]-methyl}-1...)
Affinity DataKi:  76nM. Assay description: Binding affinity towards human gonadotropin-releasing hormone receptor
In DepthDetails ArticlePubMed