BDBM50133859 2-Amino-N-{4-[5-[(benzyl-methyl-amino)-methyl]-1-(2,6-difluoro-benzyl)-2,4-dioxo-3-phenyl-1,2,3,4-tetrahydro-thieno[2,3-d]pyrimidin-6-yl]-phenyl}-acetamide::CHEMBL332570
SMILES CN(Cc1c(sc2n(Cc3c(F)cccc3F)c(=O)n(-c3ccccc3)c(=O)c12)-c1ccc(NC(=O)CN)cc1)Cc1ccccc1
InChI Key InChIKey=IGCMTWXSJAWVSM-UHFFFAOYSA-N
Data  1 KI
  Tab Delimited (TSV)   2D SDfile   Computed 3D by Vconf -m prep SDfile
Find this compound or compounds like it in BindingDB:
Activity Spreadsheet -- Enzyme Inhibition Constant Data from BindingDB
Found 1 hit for monomerid = 50133859
TargetGonadotropin-releasing hormone receptor(Homo sapiens (Human))
Neurocrine Biosciences
Curated by ChEMBL
LigandPNGBDBM50133859(2-Amino-N-{4-[5-[(benzyl-methyl-amino)-methyl]-1-(...)
Affinity DataKi:  150nM. Assay description: Binding affinity towards human gonadotropin-releasing hormone receptor
In DepthDetails ArticlePubMed