BDBM50133949 (3S,3aR,6aS)-1-Cyclopropanecarbonyl-3-methyl-4-[(S)-1-(naphthalene-1-sulfonyl)-pyrrolidine-2-carbonyl]-hexahydro-pyrrolo[3,2-b]pyrrol-2-one::CHEMBL436413
SMILES C[C@H]1[C@@H]2[C@H](CCN2C(=O)[C@@H]2CCCN2S(=O)(=O)c2cccc3ccccc23)N(C(=O)C2CC2)C1=O
InChI Key InChIKey=SMTKKAQLSUXDPL-NGXQKHRBSA-N
Data  1 KI  1 IC50
  Tab Delimited (TSV)   2D SDfile   Computed 3D by Vconf -m prep SDfile
Find this compound or compounds like it in BindingDB:
Activity Spreadsheet -- Enzyme Inhibition Constant Data from BindingDB
Found 2 hits for monomerid = 50133949
TargetCapsid scaffolding protein(Human cytomegalovirus (strain AD169) (HHV-5) (Huma...)
Glaxosmithkline
Curated by ChEMBL
LigandPNGBDBM50133949((3S,3aR,6aS)-1-Cyclopropanecarbonyl-3-methyl-4-[(S...)
Affinity DataKi:  60nM. Assay description: Potency against human cytomegalovirus protease in HCMV pNA assay
In DepthDetails ArticlePubMed
TargetCapsid scaffolding protein(Human cytomegalovirus (strain AD169) (HHV-5) (Huma...)
Glaxosmithkline
Curated by ChEMBL
LigandPNGBDBM50133949((3S,3aR,6aS)-1-Cyclopropanecarbonyl-3-methyl-4-[(S...)
Affinity DataIC50:  370nM. Assay description: Inhibition of human cytomegalovirus protease in HCMV pNA assay.
In DepthDetails ArticlePubMed