BDBM50133979 (3S,3aR,6aS)-1-Cyclopropanecarbonyl-4-[(S)-1-(4-isopropoxy-benzenesulfonyl)-pyrrolidine-2-carbonyl]-3-methyl-hexahydro-pyrrolo[3,2-b]pyrrol-2-one::CHEMBL138427
SMILES CC(C)Oc1ccc(cc1)S(=O)(=O)N1CCC[C@H]1C(=O)N1CC[C@H]2[C@H]1[C@H](C)C(=O)N2C(=O)C1CC1
InChI Key InChIKey=FDICKMFGPCJIEH-IRNNPGBSSA-N
Data  1 KI  1 IC50
  Tab Delimited (TSV)   2D SDfile   Computed 3D by Vconf -m prep SDfile
Find this compound or compounds like it in BindingDB:
Activity Spreadsheet -- Enzyme Inhibition Constant Data from BindingDB
Found 2 hits for monomerid = 50133979
TargetCapsid scaffolding protein(Human cytomegalovirus (strain AD169) (HHV-5) (Huma...)
Glaxosmithkline
Curated by ChEMBL
LigandPNGBDBM50133979((3S,3aR,6aS)-1-Cyclopropanecarbonyl-4-[(S)-1-(4-is...)
Affinity DataKi:  39nM. Assay description: Potency against human cytomegalovirus protease in HCMV pNA assay
In DepthDetails ArticlePubMed
TargetCapsid scaffolding protein(Human cytomegalovirus (strain AD169) (HHV-5) (Huma...)
Glaxosmithkline
Curated by ChEMBL
LigandPNGBDBM50133979((3S,3aR,6aS)-1-Cyclopropanecarbonyl-4-[(S)-1-(4-is...)
Affinity DataIC50:  400nM. Assay description: Inhibition of human cytomegalovirus protease in HCMV pNA assay.
In DepthDetails ArticlePubMed