BDBM50134082 (4-{(4-Bromo-phenyl)-[(E)-ethoxyimino]-methyl}-4'-methyl-[1,4']bipiperidinyl-1'-yl)-(2-hydroxy-4,6-dimethyl-pyridin-3-yl)-methanone::CHEMBL138879
SMILES CCO\N=C(/C1CCN(CC1)C1(C)CCN(CC1)C(=O)c1c(C)cc(C)[nH]c1=O)c1ccc(Br)cc1
InChI Key InChIKey=NSNVDTQEDMRJDI-GDWJVWIDSA-N
Data  1 KI
  Tab Delimited (TSV)   2D SDfile   Computed 3D by Vconf -m prep SDfile
Find this compound or compounds like it in BindingDB:
Activity Spreadsheet -- Enzyme Inhibition Constant Data from BindingDB
Found 1 hit for monomerid = 50134082
TargetC-C chemokine receptor type 5(Homo sapiens (Human))
Lindsley F. Kimball Research Institute
Curated by ChEMBL
LigandPNGBDBM50134082((4-{(4-Bromo-phenyl)-[(E)-ethoxyimino]-methyl}-4'-...)
Affinity DataKi:  43nM. Assay description: Inhibition of RANTES binding to the human C-C chemokine receptor type 5 (CCR5)
In DepthDetails ArticlePubMed