BDBM50134163 (S)-1-((S)-1-{3-[(S)-2-(Pyrrolidine-1-carbonyl)-pyrrolidine-1-carbonyl]-benzoyl}-pyrrolidine-2-carbonyl)-pyrrolidine-2-carbonitrile::CHEMBL140461
SMILES O=C([C@@H]1CCCN1C(=O)c1cccc(c1)C(=O)N1CCC[C@H]1C(=O)N1CCC[C@H]1C#N)N1CCCC1
InChI Key InChIKey=YBZDFWNYUGEHPT-VABKMULXSA-N
Data  2 IC50
  Tab Delimited (TSV)   2D SDfile   Computed 3D by Vconf -m prep SDfile
Find this compound or compounds like it in BindingDB:
Activity Spreadsheet -- Enzyme Inhibition Constant Data from BindingDB
Found 2 hits for monomerid = 50134163
TargetProlyl endopeptidase(Sus scrofa)
University Of Kuopio
Curated by ChEMBL
LigandPNGBDBM50134163((S)-1-((S)-1-{3-[(S)-2-(Pyrrolidine-1-carbonyl)-py...)
Affinity DataIC50:  1.5nMpH: 7.0Assay Description:In vitro inhibitory activity against porcine prolyl oligopeptidase by using 4 mM Suc-Gly-Pro-7-amido-4-methylcoumarin as substrate (pH 7.0) at 30 deg...
In DepthDetails ArticlePubMed
TargetProlyl endopeptidase(Sus scrofa)
University Of Kuopio
Curated by ChEMBL
LigandPNGBDBM50134163((S)-1-((S)-1-{3-[(S)-2-(Pyrrolidine-1-carbonyl)-py...)
Affinity DataIC50:  1.5nM. Assay description: In vitro inhibition of prolyl oligopeptidase (POP) from pig brain
In DepthDetails ArticlePubMed