BDBM50134546 CHEMBL3745732
SMILES NS(=O)(=O)c1ccc(cc1)N1N=C(CC1c1ccco1)c1ccco1
InChI Key InChIKey=LFTBTXRZYMBASU-UHFFFAOYSA-N
Data  2 IC50
  Tab Delimited (TSV)   2D SDfile   Computed 3D by Vconf -m prep SDfile
Find this compound or compounds like it in BindingDB:
Activity Spreadsheet -- Enzyme Inhibition Constant Data from BindingDB
Found 2 hits for monomerid = 50134546
TargetProstaglandin G/H synthase 1(Ovis aries (Sheep))
Beni-Suef University
Curated by ChEMBL
LigandPNGBDBM50134546(CHEMBL3745732)
Affinity DataIC50:  9.65E+3nM. Assay description: Inhibition of ovine COX1 by enzyme immuno assay
In DepthDetails ArticlePubMed
TargetProstaglandin G/H synthase 2(Homo sapiens (Human))
Beni-Suef University
Curated by ChEMBL
LigandPNGBDBM50134546(CHEMBL3745732)
Affinity DataIC50:  4.13E+3nM. Assay description: Inhibition of human recombinant COX2 by enzyme immuno assay
In DepthDetails ArticlePubMed