BDBM50134590 CHEMBL3747443
SMILES NC(=O)c1nc(ccc1N)-c1ccncc1
InChI Key InChIKey=WJYRUYCPJGTZBM-UHFFFAOYSA-N
Data  1 IC50
  Tab Delimited (TSV)   2D SDfile   Computed 3D by Vconf -m prep SDfile
Find this compound or compounds like it in BindingDB:
Activity Spreadsheet -- Enzyme Inhibition Constant Data from BindingDB
Found 1 hit for monomerid = 50134590
TargetDual specificity mitogen-activated protein kinase kinase 3(Homo sapiens (Human))
Takeda California
Curated by ChEMBL
LigandPNGBDBM50134590(CHEMBL3747443)
Affinity DataIC50:  30nM. Assay description: Inhibition of MKK3 (unknown origin) using [gamma-33P]-ATP after 20 mins by radiometric assay
In DepthDetails ArticlePubMed