BDBM50135053 2,4-Diamino-1-piperazin-1-yl-butan-1-one::CHEMBL148392
SMILES NCCC(N)C(=O)N1CCNCC1
InChI Key InChIKey=WRBYJQJHVAKNBW-UHFFFAOYSA-N
Data  2 IC50
  Tab Delimited (TSV)   2D SDfile   Computed 3D by Vconf -m prep SDfile
Find this compound or compounds like it in BindingDB:
Activity Spreadsheet -- Enzyme Inhibition Constant Data from BindingDB
Found 2 hits for monomerid = 50135053
TargetDipeptidyl peptidase 4(Homo sapiens (Human))
University Of Antwerp (Uia)
Curated by ChEMBL
LigandPNGBDBM50135053(2,4-Diamino-1-piperazin-1-yl-butan-1-one | CHEMBL1...)
Affinity DataIC50: >1.00E+6nM. Assay description: Inhibitory activity against Dipeptidylpeptidase IV (DPP IV)
In DepthDetails ArticlePubMed
TargetDipeptidyl peptidase 2(Homo sapiens (Human))
University Of Antwerp (Uia)
Curated by ChEMBL
LigandPNGBDBM50135053(2,4-Diamino-1-piperazin-1-yl-butan-1-one | CHEMBL1...)
Affinity DataIC50:  2.93E+4nM. Assay description: Inhibitory activity of compound against Dipeptidylpeptidase II (DPP II)
In DepthDetails ArticlePubMed